Target
Transporter
Ligand
BDBM50028286
Substrate
Meas. Tech.
ChEBML_184434
Ki
0.810000±n/a nM
Citation
 Maryanoff, BEMcComsey, DFCastanzo, MJSetler, PEGardocki, JFShank, RPSchneider, CR Pyrroloisoquinoline antidepressants. Potent, enantioselective inhibition of tetrabenazine-induced ptosis and neuronal uptake of norepinephrine, dopamine, and serotonin. J Med Chem 27:943-6 (1984)  
Target
Name:
Transporter
Synonyms:
Monoamine transporters; Norepininephrine & dopamine | Norepinephrine Monoamine transporters
Type:
PROTEIN
Mol. Mass.:
66787.87
Organism:
Rattus norvegicus
Description:
ChEMBL_1463061
Residue:
597
  
Inhibitor
Name:
BDBM50028286
Synonyms:
4-(1,2,3,5,6,10b-Hexahydro-pyrrolo[2,1-a]isoquinolin-6-yl)-benzene-1,2-diol; hydrobromide | CHEMBL553692
Type:
Small organic molecule
Emp. Form.:
C18H19NO2
Mol. Mass.:
281.349
SMILES:
Oc1ccc(cc1O)C1CN2CCC[C@H]2c2ccccc12
: