Target
Transporter
Ligand
BDBM50452190
Substrate
Meas. Tech.
ChEBML_184434
Ki
0.200000±n/a nM
Citation
 Maryanoff, BEMcComsey, DFCastanzo, MJSetler, PEGardocki, JFShank, RPSchneider, CR Pyrroloisoquinoline antidepressants. Potent, enantioselective inhibition of tetrabenazine-induced ptosis and neuronal uptake of norepinephrine, dopamine, and serotonin. J Med Chem 27:943-6 (1984)  
Target
Name:
Transporter
Synonyms:
Monoamine transporters; Norepininephrine & dopamine | Norepinephrine Monoamine transporters
Type:
PROTEIN
Mol. Mass.:
66787.87
Organism:
Rattus norvegicus
Description:
ChEMBL_1463061
Residue:
597
  
Inhibitor
Name:
BDBM50452190
Synonyms:
CHEMBL2093944
Type:
Small organic molecule
Emp. Form.:
C18H21BrN2
Mol. Mass.:
345.277
SMILES:
Br.[H][C@@]12CCCN1C[C@H](c1ccc(N)cc1)c1ccccc21
: