Target
Sodium-dependent serotonin transporter
Ligand
BDBM50028287
Substrate
Meas. Tech.
ChEBML_184436
Ki
1.7±n/a nM
Citation
 Maryanoff, BEMcComsey, DFCastanzo, MJSetler, PEGardocki, JFShank, RPSchneider, CR Pyrroloisoquinoline antidepressants. Potent, enantioselective inhibition of tetrabenazine-induced ptosis and neuronal uptake of norepinephrine, dopamine, and serotonin. J Med Chem 27:943-6 (1984)  
Target
Name:
Sodium-dependent serotonin transporter
Synonyms:
5-HT Transporter 5HT transporter Anandamid membrane transporter, AMT Monoamine transporters; Norepinephrine & serotonin Slc6a4 Sodium-dependent serotonin transporter (SERT) | imipramine receptor
Type:
Multi-pass membrane protein
Mol. Mass.:
70168.43
Organism:
Rattus norvegicus (rat)
Description:
P31652
Residue:
630
  
Inhibitor
Name:
BDBM50028287
Synonyms:
6-(4-Methoxy-phenyl)-1,2,3,5,6,10b-hexahydro-pyrrolo[2,1-a]isoquinoline; hydrobromide | CHEMBL538310
Type:
Small organic molecule
Emp. Form.:
C19H21NO
Mol. Mass.:
279.3761
SMILES:
COc1ccc(cc1)C1CN2CCC[C@H]2c2ccccc12
: