Target
Sodium-dependent serotonin transporter
Ligand
BDBM50028276
Substrate
Meas. Tech.
ChEBML_184436
Ki
1.8±n/a nM
Citation
 Maryanoff, BEMcComsey, DFCastanzo, MJSetler, PEGardocki, JFShank, RPSchneider, CR Pyrroloisoquinoline antidepressants. Potent, enantioselective inhibition of tetrabenazine-induced ptosis and neuronal uptake of norepinephrine, dopamine, and serotonin. J Med Chem 27:943-6 (1984)  
Target
Name:
Sodium-dependent serotonin transporter
Synonyms:
5-HT Transporter 5HT transporter Anandamid membrane transporter, AMT Monoamine transporters; Norepinephrine & serotonin Slc6a4 Sodium-dependent serotonin transporter (SERT) | imipramine receptor
Type:
Multi-pass membrane protein
Mol. Mass.:
70168.43
Organism:
Rattus norvegicus (rat)
Description:
P31652
Residue:
630
  
Inhibitor
Name:
BDBM50028276
Synonyms:
6-(3,4-Dichloro-phenyl)-1,2,3,5,6,10b-hexahydro-pyrrolo[2,1-a]isoquinoline | CHEMBL171474
Type:
Small organic molecule
Emp. Form.:
C18H17Cl2N
Mol. Mass.:
318.24
SMILES:
Clc1ccc(cc1Cl)C1CN2CCC[C@H]2c2ccccc12
: