Target
Angiotensin-converting enzyme
Ligand
BDBM50020761
Substrate
Meas. Tech.
ChEBML_34798
IC50
19±n/a nM
Citation
 Suh, JTSkiles, JWWilliams, BEYoussefyeh, RDJones, HLoev, BNeiss, ESSchwab, AMann, WSKhandwala, A Angiotensin-converting enzyme inhibitors. New orally active antihypertensive (mercaptoalkanoyl)- and [(acylthio)alkanoyl]glycine derivatives. J Med Chem 28:57-66 (1985)  
Target
Name:
Angiotensin-converting enzyme
Synonyms:
3.2.1.- ACE Angiotensin-converting enzyme, soluble form DCP1 Kininase II
Type:
Mol. Mass.:
150405.15
Organism:
Oryctolagus cuniculus
Description:
Residue:
1310
  
Inhibitor
Name:
BDBM50020761
Synonyms:
CHEMBL346255 | [(3-Mercapto-2-methyl-propionyl)-m-tolyl-amino]-acetic acid
Type:
Small organic molecule
Emp. Form.:
C13H17NO3S
Mol. Mass.:
267.344
SMILES:
CC(CS)C(=O)N(CC(O)=O)c1cccc(C)c1
: