Target
Sodium-dependent serotonin transporter
Ligand
BDBM50021226
Substrate
Meas. Tech.
ChEBML_176338
IC50
0.480000±n/a nM
Citation
 Bøgesø, KPChristensen, AVHyttel, JLiljefors, T 3-Phenyl-1-indanamines. Potential antidepressant activity and potent inhibition of dopamine, norepinephrine, and serotonin uptake. J Med Chem 28:1817-28 (1986)  
Target
Name:
Sodium-dependent serotonin transporter
Synonyms:
5-HT Transporter 5HT transporter Anandamid membrane transporter, AMT Monoamine transporters; Norepinephrine & serotonin Slc6a4 Sodium-dependent serotonin transporter (SERT) | imipramine receptor
Type:
Multi-pass membrane protein
Mol. Mass.:
70168.43
Organism:
Rattus norvegicus (rat)
Description:
P31652
Residue:
630
  
Inhibitor
Name:
BDBM50021226
Synonyms:
CHEMBL296602 [3-(3,4-Dichloro-phenyl)-indan-1-yl]-methyl-amine | [3-(3,4-Dichloro-phenyl)-indan-1-yl]-methyl-amine; hydrochloride
Type:
Small organic molecule
Emp. Form.:
C16H15Cl2N
Mol. Mass.:
292.203
SMILES:
CNC1CC(c2ccccc12)c1ccc(Cl)c(Cl)c1
: