Target
Sodium-dependent serotonin transporter
Ligand
BDBM50021238
Substrate
Meas. Tech.
ChEMBL_176338 (CHEMBL784031)
IC50
0.340000±n/a nM
Citation
 Bøgesø, KPChristensen, AVHyttel, JLiljefors, T 3-Phenyl-1-indanamines. Potential antidepressant activity and potent inhibition of dopamine, norepinephrine, and serotonin uptake. J Med Chem 28:1817-28 (1986)  
Target
Name:
Sodium-dependent serotonin transporter
Synonyms:
5-HT Transporter 5HT transporter Anandamid membrane transporter, AMT Monoamine transporters; Norepinephrine & serotonin Slc6a4 Sodium-dependent serotonin transporter (SERT) | imipramine receptor
Type:
Multi-pass membrane protein
Mol. Mass.:
70168.43
Organism:
Rattus norvegicus (rat)
Description:
P31652
Residue:
630
  
Inhibitor
Name:
BDBM50021238
Synonyms:
CHEMBL50635 | [3-(4-Chloro-phenyl)-indan-1-yl]-dimethyl-amine
Type:
Small organic molecule
Emp. Form.:
C17H18ClN
Mol. Mass.:
271.785
SMILES:
CN(C)C1CC(c2ccccc12)c1ccc(Cl)cc1
: