Target
4-aminobutyrate aminotransferase, mitochondrial
Ligand
BDBM50015034
Substrate
Meas. Tech.
ChEMBL_70654 (CHEMBL678644)
pH
8.5±n/a
Ki
395000±n/a nM
Comments
extracted
Citation
 Silverman, RBInvergo, BJMathew, J Inactivation of gamma-aminobutyric acid aminotransferase by (S,E)-4-amino-5-fluoropent-2-enoic acid and effect on the enzyme of (E)-3-(1-aminocyclopropyl)-2-propenoic acid. J Med Chem 29:1840-6 (1986)  
Target
Name:
4-aminobutyrate aminotransferase, mitochondrial
Synonyms:
(S)-3-amino-2-methylpropionate transaminase 2.6.1.22 ABAT GABA transaminase GABA-T GABT_PIG L-AIBAT
Type:
Mol. Mass.:
56633.06
Organism:
Sus scrofa
Description:
Residue:
500
  
Inhibitor
Name:
BDBM50015034
Synonyms:
3-Carboxy-1-fluoromethyl-propyl-ammonium CHEMBL161636
Type:
Small organic molecule
Emp. Form.:
C5H10FNO2
Mol. Mass.:
135.1368
SMILES:
N[C@H](CF)CCC(O)=O
: