Target
D(2) dopamine receptor
Ligand
BDBM50025202
Substrate
Meas. Tech.
ChEBML_59480
Ki
5740±n/a nM
Citation
 Ladd, DLWeinstock, JWise, MGessner, GWSawyer, JLFlaim, KE Synthesis and dopaminergic binding of 2-aryldopamine analogues: phenethylamines, 3-benzazepines, and 9-(aminomethyl)fluorenes. J Med Chem 29:1904-12 (1986)  
Target
Name:
D(2) dopamine receptor
Synonyms:
DOPAMINE D2 DRD2_BOVIN | Dopamine D2 receptor
Type:
Enzyme Catalytic Domain
Mol. Mass.:
50698.79
Organism:
BOVINE
Description:
P20288
Residue:
444
  
Inhibitor
Name:
BDBM50025202
Synonyms:
9-Aminomethyl-9H-fluorene-2,5,6-triol | CHEMBL57672
Type:
Small organic molecule
Emp. Form.:
C14H13NO3
Mol. Mass.:
243.2579
SMILES:
NCC1c2cc(O)ccc2-c2c1ccc(O)c2O
: