Target
D(2) dopamine receptor
Ligand
BDBM50025203
Substrate
Meas. Tech.
ChEBML_59480
Ki
1800±n/a nM
Citation
 Ladd, DLWeinstock, JWise, MGessner, GWSawyer, JLFlaim, KE Synthesis and dopaminergic binding of 2-aryldopamine analogues: phenethylamines, 3-benzazepines, and 9-(aminomethyl)fluorenes. J Med Chem 29:1904-12 (1986)  
Target
Name:
D(2) dopamine receptor
Synonyms:
DOPAMINE D2 DRD2_BOVIN | Dopamine D2 receptor
Type:
Enzyme Catalytic Domain
Mol. Mass.:
50698.79
Organism:
BOVINE
Description:
P20288
Residue:
444
  
Inhibitor
Name:
BDBM50025203
Synonyms:
6-(2-Dipropylamino-ethyl)-biphenyl-2,3,4'-triol | CHEMBL60861
Type:
Small organic molecule
Emp. Form.:
C20H27NO3
Mol. Mass.:
329.4333
SMILES:
CCCN(CCC)CCc1ccc(O)c(O)c1-c1ccc(O)cc1
: