Target
D(1A) dopamine receptor
Ligand
BDBM50025210
Substrate
Meas. Tech.
ChEBML_58658
Ki
1790±n/a nM
Citation
 Ladd, DLWeinstock, JWise, MGessner, GWSawyer, JLFlaim, KE Synthesis and dopaminergic binding of 2-aryldopamine analogues: phenethylamines, 3-benzazepines, and 9-(aminomethyl)fluorenes. J Med Chem 29:1904-12 (1986)  
Target
Name:
D(1A) dopamine receptor
Synonyms:
DOPAMINE D1 Dopamine D1 high Dopamine receptor Dopamine1-like Drd1a
Type:
Enzyme Catalytic Domain
Mol. Mass.:
49429.75
Organism:
RAT
Description:
P18901
Residue:
446
  
Inhibitor
Name:
BDBM50025210
Synonyms:
6-Phenyl-2,3,4,5-tetrahydro-1H-benzo[d]azepine-7,8-diol | CHEMBL54168
Type:
Small organic molecule
Emp. Form.:
C16H17NO2
Mol. Mass.:
255.3117
SMILES:
Oc1cc2CCNCCc2c(c1O)-c1ccccc1
: