Target
Kappa-type opioid receptor
Ligand
BDBM50021324
Substrate
Meas. Tech.
ChEMBL_145704 (CHEMBL753912)
Kd
83.0±n/a nM
Citation
 Cheng, AUyeno, EPolgar, WToll, LLawson, JADeGraw, JILoew, GCamerman, ACamerman, N N-substituent modulation of opiate agonist/antagonist activity in resolved 3-methyl-3-(m-hydroxyphenyl)piperidines. J Med Chem 29:531-7 (1986)  
Target
Name:
Kappa-type opioid receptor
Synonyms:
KOR-1 OPIATE Kappa Opioid receptor Ror-d
Type:
G Protein-Coupled Receptor (GPCR)
Mol. Mass.:
42692.90
Organism:
Rattus norvegicus (rat)
Description:
P34975
Residue:
380
  
Inhibitor
Name:
BDBM50021324
Synonyms:
3-(1-Cyclopropylmethyl-3-methyl-piperidin-3-yl)-phenol CHEMBL346163
Type:
Small organic molecule
Emp. Form.:
C16H23NO
Mol. Mass.:
245.3599
SMILES:
CC1(CCCN(CC2CC2)C1)c1cccc(O)c1
: