Target
S-adenosylmethionine synthase isoform type-2
Ligand
BDBM50367328
Substrate
Meas. Tech.
ChEBML_105118
Ki
16000±n/a nM
Citation
 Kappler, FHai, TTCotter, RJHyver, KJHampton, A Isozyme-specific enzyme inhibitors. 11. L-homocysteine-ATP S-C5' covalent adducts as inhibitors of rat methionine adenosyltransferases. J Med Chem 29:1030-8 (1986)  
Target
Name:
S-adenosylmethionine synthase isoform type-2
Synonyms:
AdoMet synthetase 2 MAT 2 METK2_RAT Methionine adenosyltransferase 2 S-Adenosylmethionine Synthase (AdoMet) S-adenosylmethionine synthetase gamma form | S-adenosylmethionine synthetase isoform type-2
Type:
PROTEIN
Mol. Mass.:
43713.68
Organism:
Rattus norvegicus
Description:
ChEMBL_105118
Residue:
395
  
Inhibitor
Name:
BDBM50367328
Synonyms:
CHEMBL1791415
Type:
Small organic molecule
Emp. Form.:
C15H26N7O13P3S
Mol. Mass.:
637.392
SMILES:
NC(CCSC(CP(O)(=O)OP(O)(=O)NP(O)(O)=O)[C@H]1O[C@H]([C@H](O)[C@@H]1O)n1cnc2c(N)ncnc12)C(O)=O
: