Target
Renin
Ligand
BDBM50421761
Substrate
Meas. Tech.
ChEMBL_154893 (CHEMBL764012)
IC50
31±n/a nM
Citation
 Guégan, RDiaz, JCazaubon, CBeaumont, MCarlet, CClément, JDemarne, HMellet, MRichaud, JPSegondy, D Pepstatin analogues as novel renin inhibitors. J Med Chem 29:1152-9 (1987)  
Target
Name:
Renin
Synonyms:
RENI_RAT Ren1
Type:
PROTEIN
Mol. Mass.:
44272.67
Organism:
Rattus norvegicus
Description:
ChEMBL_222765
Residue:
402
  
Inhibitor
Name:
BDBM50421761
Synonyms:
CHEMBL2311113
Type:
Small organic molecule
Emp. Form.:
C42H63N5O10
Mol. Mass.:
797.9771
SMILES:
COC(=O)CC(O)[C@H](CC(C)C)NC(=O)[C@H](C)NC(=O)CC(O)[C@H](CC(C)C)NC(=O)[C@@H](NC(=O)[C@H](Cc1ccccc1)NC(=O)OCc1ccccc1)C(C)C
: