Target
Cytidine deaminase
Ligand
BDBM50367344
Substrate
Meas. Tech.
ChEBML_52531
Ki
4000±n/a nM
Citation
 Kim, CHMarquez, VEMao, DTHaines, DRMcCormack, JJ Synthesis of pyrimidin-2-one nucleosides as acid-stable inhibitors of cytidine deaminase. J Med Chem 29:1374-80 (1986)  
Target
Name:
Cytidine deaminase
Synonyms:
CDD_MOUSE Cdd | Cytidine aminohydrolase
Type:
PROTEIN
Mol. Mass.:
16129.75
Organism:
Mus musculus
Description:
ChEMBL_52531
Residue:
146
  
Inhibitor
Name:
BDBM50367344
Synonyms:
CHEMBL1232227 | CHEMBL604639
Type:
Small organic molecule
Emp. Form.:
C9H14N2O5
Mol. Mass.:
230.2179
SMILES:
OC[C@H]1O[C@H]([C@H](O)[C@@H]1O)N1C=CCNC1=O
: