Target
Cytidine deaminase
Ligand
BDBM50367349
Substrate
Meas. Tech.
ChEBML_52531
Ki
0.100000±n/a nM
Citation
 Kim, CHMarquez, VEMao, DTHaines, DRMcCormack, JJ Synthesis of pyrimidin-2-one nucleosides as acid-stable inhibitors of cytidine deaminase. J Med Chem 29:1374-80 (1986)  
Target
Name:
Cytidine deaminase
Synonyms:
CDD_MOUSE Cdd | Cytidine aminohydrolase
Type:
PROTEIN
Mol. Mass.:
16129.75
Organism:
Mus musculus
Description:
ChEMBL_52531
Residue:
146
  
Inhibitor
Name:
BDBM50367349
Synonyms:
CHEMBL604436
Type:
Small organic molecule
Emp. Form.:
C11H18N4O5
Mol. Mass.:
286.2844
SMILES:
OC[C@H]1OC([C@H](O)[C@@H]1O)N1C=NC2C1N=CNCC2O
: