Target
Cytidine deaminase
Ligand
BDBM50335291
Substrate
Meas. Tech.
ChEBML_52531
Ki
10000±n/a nM
Citation
 Kim, CHMarquez, VEMao, DTHaines, DRMcCormack, JJ Synthesis of pyrimidin-2-one nucleosides as acid-stable inhibitors of cytidine deaminase. J Med Chem 29:1374-80 (1986)  
Target
Name:
Cytidine deaminase
Synonyms:
CDD_MOUSE Cdd | Cytidine aminohydrolase
Type:
PROTEIN
Mol. Mass.:
16129.75
Organism:
Mus musculus
Description:
ChEMBL_52531
Residue:
146
  
Inhibitor
Name:
BDBM50335291
Synonyms:
9-(beta-D-ribofuranosyl)purine nebularine purine riboside | purine-1-D-ribofuranoside
Type:
Small organic molecule
Emp. Form.:
C10H12N4O4
Mol. Mass.:
252.2267
SMILES:
OC[C@H]1O[C@H]([C@H](O)[C@@H]1O)n1cnc2cncnc12
: