Target
D(2) dopamine receptor
Ligand
BDBM50019421
Substrate
Meas. Tech.
ChEBML_58559
IC50
>1000±n/a nM
Citation
 New, JSYevich, JPEison, MSTaylor, DPEison, ASRiblet, LAVanderMaelen, CPTemple, DL Buspirone analogues. 2. Structure-activity relationships of aromatic imide derivatives. J Med Chem 29:1476-82 (1986)  
Target
Name:
D(2) dopamine receptor
Synonyms:
DOPAMINE D2 DOPAMINE D2 Short Dopamine D2 receptor Drd2
Type:
G Protein-Coupled Receptor (GPCR)
Mol. Mass.:
50931.60
Organism:
Rattus norvegicus (rat)
Description:
P61169
Residue:
444
  
Inhibitor
Name:
BDBM50019421
Synonyms:
4,5,6,7-Tetrachloro-2-[4-(4-pyrimidin-2-yl-piperazin-1-yl)-butyl]-isoindole-1,3-dione | CHEMBL34017
Type:
Small organic molecule
Emp. Form.:
C20H19Cl4N5O2
Mol. Mass.:
503.209
SMILES:
Clc1c2C(=O)N(CCCCN3CCN(CC3)c3ncccn3)C(=O)c2c(Cl)c(Cl)c1Cl
: