Target
D(2) dopamine receptor
Ligand
BDBM50367354
Substrate
Meas. Tech.
ChEBML_58559
IC50
280±n/a nM
Citation
 New, JSYevich, JPEison, MSTaylor, DPEison, ASRiblet, LAVanderMaelen, CPTemple, DL Buspirone analogues. 2. Structure-activity relationships of aromatic imide derivatives. J Med Chem 29:1476-82 (1986)  
Target
Name:
D(2) dopamine receptor
Synonyms:
DOPAMINE D2 DOPAMINE D2 Short Dopamine D2 receptor Drd2
Type:
G Protein-Coupled Receptor (GPCR)
Mol. Mass.:
50931.60
Organism:
Rattus norvegicus (rat)
Description:
P61169
Residue:
444
  
Inhibitor
Name:
BDBM50367354
Synonyms:
CHEMBL1744357
Type:
Small organic molecule
Emp. Form.:
C28H34N4O2S
Mol. Mass.:
490.66
SMILES:
O=C1CC2(CCCc3ccccc23)C(=O)N1CCCCN1CCN(CC1)N1Cc2ccccc2S1
: