Target
D(2) dopamine receptor
Ligand
BDBM50019425
Substrate
Meas. Tech.
ChEBML_58559
IC50
>1000±n/a nM
Citation
 New, JSYevich, JPEison, MSTaylor, DPEison, ASRiblet, LAVanderMaelen, CPTemple, DL Buspirone analogues. 2. Structure-activity relationships of aromatic imide derivatives. J Med Chem 29:1476-82 (1986)  
Target
Name:
D(2) dopamine receptor
Synonyms:
DOPAMINE D2 DOPAMINE D2 Short Dopamine D2 receptor Drd2
Type:
G Protein-Coupled Receptor (GPCR)
Mol. Mass.:
50931.60
Organism:
Rattus norvegicus (rat)
Description:
P61169
Residue:
444
  
Inhibitor
Name:
BDBM50019425
Synonyms:
2-{4-[4-(2,5-Dioxo-3,3-diphenyl-pyrrolidin-1-yl)-butyl]-piperazin-1-yl}-nicotinonitrile | CHEMBL288101
Type:
Small organic molecule
Emp. Form.:
C30H31N5O2
Mol. Mass.:
493.5994
SMILES:
O=C1CC(C(=O)N1CCCCN1CCN(CC1)c1ncccc1C#N)(c1ccccc1)c1ccccc1
: