Target
D(2) dopamine receptor
Ligand
BDBM50019431
Substrate
Meas. Tech.
ChEBML_58559
IC50
>1000±n/a nM
Citation
 New, JSYevich, JPEison, MSTaylor, DPEison, ASRiblet, LAVanderMaelen, CPTemple, DL Buspirone analogues. 2. Structure-activity relationships of aromatic imide derivatives. J Med Chem 29:1476-82 (1986)  
Target
Name:
D(2) dopamine receptor
Synonyms:
DOPAMINE D2 DOPAMINE D2 Short Dopamine D2 receptor Drd2
Type:
G Protein-Coupled Receptor (GPCR)
Mol. Mass.:
50931.60
Organism:
Rattus norvegicus (rat)
Description:
P61169
Residue:
444
  
Inhibitor
Name:
BDBM50019431
Synonyms:
3-(4-Fluoro-phenyl)-3-methyl-1-[2-(4-pyrimidin-2-yl-piperazin-1-yl)-ethyl]-pyrrolidine-2,5-dione | CHEMBL36175
Type:
Small organic molecule
Emp. Form.:
C21H24FN5O2
Mol. Mass.:
397.446
SMILES:
CC1(CC(=O)N(CCN2CCN(CC2)c2ncccn2)C1=O)c1ccc(F)cc1
: