Target
Polyunsaturated fatty acid 5-lipoxygenase
Ligand
BDBM50024845
Substrate
Meas. Tech.
ChEMBL_3944 (CHEMBL619944)
IC50
2540±n/a nM
Citation
 Buckle, DRFoster, KATaylor, JFTedder, JMThody, VEWebster, RABermudez, JMarkwell, RESmith, SA Novel 1H-benzimidazol-4-ols with potent 5-lipoxygenase inhibitory activity. J Med Chem 30:2216-21 (1988)  
Target
Name:
Polyunsaturated fatty acid 5-lipoxygenase
Synonyms:
Alox5 LOX5_RAT
Type:
PROTEIN
Mol. Mass.:
78082.31
Organism:
Rattus norvegicus
Description:
ChEMBL_1432947
Residue:
673
  
Inhibitor
Name:
BDBM50024845
Synonyms:
7-Methyl-2-(4-methyl-benzyl)-1H-benzoimidazol-4-ol | CHEMBL303956
Type:
Small organic molecule
Emp. Form.:
C16H16N2O
Mol. Mass.:
252.311
SMILES:
Cc1ccc(Cc2nc3c(O)ccc(C)c3[nH]2)cc1
: