Target
Polyunsaturated fatty acid 5-lipoxygenase
Ligand
BDBM50024854
Substrate
Meas. Tech.
ChEMBL_3947 (CHEMBL619947)
IC50
5000±n/a nM
Citation
 Buckle, DRFoster, KATaylor, JFTedder, JMThody, VEWebster, RABermudez, JMarkwell, RESmith, SA Novel 1H-benzimidazol-4-ols with potent 5-lipoxygenase inhibitory activity. J Med Chem 30:2216-21 (1988)  
Target
Name:
Polyunsaturated fatty acid 5-lipoxygenase
Synonyms:
Alox5 LOX5_RAT
Type:
PROTEIN
Mol. Mass.:
78082.31
Organism:
Rattus norvegicus
Description:
ChEMBL_1432947
Residue:
673
  
Inhibitor
Name:
BDBM50024854
Synonyms:
7-Methyl-2-pyridin-3-ylmethyl-1H-benzoimidazol-4-ol | CHEMBL302982
Type:
Small organic molecule
Emp. Form.:
C14H13N3O
Mol. Mass.:
239.2725
SMILES:
Cc1ccc(O)c2nc(Cc3cccnc3)[nH]c12
: