Target
Polyunsaturated fatty acid 5-lipoxygenase
Ligand
BDBM50367456
Substrate
Meas. Tech.
ChEMBL_3938 (CHEMBL619940)
IC50
2200±n/a nM
Citation
 Buckle, DRFoster, KATaylor, JFTedder, JMThody, VEWebster, RABermudez, JMarkwell, RESmith, SA Novel 1H-benzimidazol-4-ols with potent 5-lipoxygenase inhibitory activity. J Med Chem 30:2216-21 (1988)  
Target
Name:
Polyunsaturated fatty acid 5-lipoxygenase
Synonyms:
Alox5 LOX5_RAT
Type:
PROTEIN
Mol. Mass.:
78082.31
Organism:
Rattus norvegicus
Description:
ChEMBL_1432947
Residue:
673
  
Inhibitor
Name:
BDBM50367456
Synonyms:
CHEMBL1202797
Type:
Small organic molecule
Emp. Form.:
C15H14N2O2
Mol. Mass.:
254.2839
SMILES:
COc1ccc(cc1)-c1nc2c(O)ccc(C)c2[nH]1
: