Target
Polyunsaturated fatty acid 5-lipoxygenase
Ligand
BDBM50367457
Substrate
Meas. Tech.
ChEMBL_3932 (CHEMBL619934)
IC50
1200±n/a nM
Citation
 Buckle, DRFoster, KATaylor, JFTedder, JMThody, VEWebster, RABermudez, JMarkwell, RESmith, SA Novel 1H-benzimidazol-4-ols with potent 5-lipoxygenase inhibitory activity. J Med Chem 30:2216-21 (1988)  
Target
Name:
Polyunsaturated fatty acid 5-lipoxygenase
Synonyms:
Alox5 LOX5_RAT
Type:
PROTEIN
Mol. Mass.:
78082.31
Organism:
Rattus norvegicus
Description:
ChEMBL_1432947
Residue:
673
  
Inhibitor
Name:
BDBM50367457
Synonyms:
CHEMBL1202795
Type:
Small organic molecule
Emp. Form.:
C14H12N2O
Mol. Mass.:
224.2579
SMILES:
Cc1ccc(O)c2nc([nH]c12)-c1ccccc1
: