Target
Polyunsaturated fatty acid 5-lipoxygenase
Ligand
BDBM50024863
Substrate
Meas. Tech.
ChEMBL_3929 (CHEMBL619931)
IC50
1200±n/a nM
Citation
 Buckle, DRFoster, KATaylor, JFTedder, JMThody, VEWebster, RABermudez, JMarkwell, RESmith, SA Novel 1H-benzimidazol-4-ols with potent 5-lipoxygenase inhibitory activity. J Med Chem 30:2216-21 (1988)  
Target
Name:
Polyunsaturated fatty acid 5-lipoxygenase
Synonyms:
Alox5 LOX5_RAT
Type:
PROTEIN
Mol. Mass.:
78082.31
Organism:
Rattus norvegicus
Description:
ChEMBL_1432947
Residue:
673
  
Inhibitor
Name:
BDBM50024863
Synonyms:
2-Benzyl-7-methyl-1H-benzoimidazol-4-ol | CHEMBL67579
Type:
Small organic molecule
Emp. Form.:
C15H14N2O
Mol. Mass.:
238.2845
SMILES:
Cc1ccc(O)c2nc(Cc3ccccc3)[nH]c12
: