Target
Polyunsaturated fatty acid 5-lipoxygenase
Ligand
BDBM50367464
Substrate
Meas. Tech.
ChEMBL_3948 (CHEMBL619948)
IC50
6900±n/a nM
Citation
 Buckle, DRFoster, KATaylor, JFTedder, JMThody, VEWebster, RABermudez, JMarkwell, RESmith, SA Novel 1H-benzimidazol-4-ols with potent 5-lipoxygenase inhibitory activity. J Med Chem 30:2216-21 (1988)  
Target
Name:
Polyunsaturated fatty acid 5-lipoxygenase
Synonyms:
Alox5 LOX5_RAT
Type:
PROTEIN
Mol. Mass.:
78082.31
Organism:
Rattus norvegicus
Description:
ChEMBL_1432947
Residue:
673
  
Inhibitor
Name:
BDBM50367464
Synonyms:
CHEMBL1202801
Type:
Small organic molecule
Emp. Form.:
C15H14N2O2
Mol. Mass.:
254.2839
SMILES:
Cc1ccc(O)c2nc(Cc3ccc(O)cc3)[nH]c12
: