Target
Polyunsaturated fatty acid 5-lipoxygenase
Ligand
BDBM50367465
Substrate
Meas. Tech.
ChEMBL_3946 (CHEMBL619946)
IC50
5200±n/a nM
Citation
 Buckle, DRFoster, KATaylor, JFTedder, JMThody, VEWebster, RABermudez, JMarkwell, RESmith, SA Novel 1H-benzimidazol-4-ols with potent 5-lipoxygenase inhibitory activity. J Med Chem 30:2216-21 (1988)  
Target
Name:
Polyunsaturated fatty acid 5-lipoxygenase
Synonyms:
Alox5 LOX5_RAT
Type:
PROTEIN
Mol. Mass.:
78082.31
Organism:
Rattus norvegicus
Description:
ChEMBL_1432947
Residue:
673
  
Inhibitor
Name:
BDBM50367465
Synonyms:
CHEMBL1202800
Type:
Small organic molecule
Emp. Form.:
C17H18N2O3
Mol. Mass.:
298.3364
SMILES:
COc1ccc(Cc2nc3c(O)ccc(C)c3[nH]2)cc1OC
: