Target
Dipeptidase 1
Ligand
BDBM50023946
Substrate
Meas. Tech.
ChEBML_216035
Ki
150±n/a nM
Citation
 Graham, DWAshton, WTBarash, LBrown, JEBrown, RDCanning, LFChen, ASpringer, JPRogers, EF Inhibition of the mammalian beta-lactamase renal dipeptidase (dehydropeptidase-I) by (Z)-2-(acylamino)-3-substituted-propenoic acids. J Med Chem 30:1074-90 (1987)  
Target
Name:
Dipeptidase 1
Synonyms:
DPEP1 Dipeptidase 1 Microsomal dipeptidase Renal dipeptidase
Type:
Enzyme Catalytic Domain
Mol. Mass.:
44697.32
Organism:
GUINEA PIG
Description:
Leukotriene D4 Alpha 0 GUINEA PIG::P22412
Residue:
409
  
Inhibitor
Name:
BDBM50023946
Synonyms:
4-Cyclohexyl-2-[(2,2-dimethyl-cyclopropanecarbonyl)-amino]-but-2-enoic acid | CHEMBL275319
Type:
Small organic molecule
Emp. Form.:
C16H25NO3
Mol. Mass.:
279.3746
SMILES:
CC1(C)CC1C(=O)N\C(=C/CC1CCCCC1)C(O)=O
: