Target
Dipeptidase 1
Ligand
BDBM50024058
Substrate
Meas. Tech.
ChEBML_216035
Ki
160±n/a nM
Citation
 Graham, DWAshton, WTBarash, LBrown, JEBrown, RDCanning, LFChen, ASpringer, JPRogers, EF Inhibition of the mammalian beta-lactamase renal dipeptidase (dehydropeptidase-I) by (Z)-2-(acylamino)-3-substituted-propenoic acids. J Med Chem 30:1074-90 (1987)  
Target
Name:
Dipeptidase 1
Synonyms:
DPEP1 Dipeptidase 1 Microsomal dipeptidase Renal dipeptidase
Type:
Enzyme Catalytic Domain
Mol. Mass.:
44697.32
Organism:
GUINEA PIG
Description:
Leukotriene D4 Alpha 0 GUINEA PIG::P22412
Residue:
409
  
Inhibitor
Name:
BDBM50024058
Synonyms:
7-(2-Carboxy-2-oxo-ethylsulfanyl)-2-[(2,2-dimethyl-cyclopropanecarbonyl)-amino]-hept-2-enoic acid | CHEMBL417431
Type:
Small organic molecule
Emp. Form.:
C16H23NO6S
Mol. Mass.:
357.422
SMILES:
CC1(C)CC1C(=O)NC(=CCCCCSCC(=O)C(O)=O)C(O)=O
: