Target
Aromatase
Ligand
BDBM50024491
Substrate
Meas. Tech.
ChEBML_51214
EC50
1200±n/a nM
Citation
 Taylor, HMJones, CDDavenport, JDHirsch, KSKress, TJWeaver, D Aromatase inhibition by 5-substituted pyrimidines and dihydropyrimidines. J Med Chem 30:1359-65 (1987)  
Target
Name:
Aromatase
Synonyms:
Arom CP19A_RAT Cyp19 Cytochrome P450 19A1 P-450AROM
Type:
PROTEIN
Mol. Mass.:
58418.09
Organism:
Rattus norvegicus
Description:
ChEMBL_51211
Residue:
508
  
Inhibitor
Name:
BDBM50024491
Synonyms:
5-[(2-Chloro-phenyl)-fluoro-(4-fluoro-phenyl)-methyl]-pyrimidine | CHEMBL29952
Type:
Small organic molecule
Emp. Form.:
C17H11ClF2N2
Mol. Mass.:
316.732
SMILES:
Fc1ccc(cc1)C(F)(c1cncnc1)c1ccccc1Cl
: