Target
Renin
Ligand
BDBM50368278
Substrate
Meas. Tech.
ChEBML_196287
IC50
0.110000±n/a nM
Citation
 Sawyer, TKPals, DTMao, BStaples, DJde Vaux, AEMaggiora, LLAffholter, JAKati, WDuchamp, DHester, JB Design, structure-activity, and molecular modeling studies of potent renin inhibitory peptides having N-terminal Nin-For-Trp (Ftr): angiotensinogen congeners modified by P1-P1' Phe-Phe, Sta, Leu psi[CH(OH)CH2]Val or leu psi[CH2NH]Val substitutions. J Med Chem 31:18-30 (1988)  
Target
Name:
Renin
Synonyms:
Angiotensinogenase RENI_HUMAN
Type:
Enzyme
Mol. Mass.:
45058.99
Organism:
Homo sapiens (Human)
Description:
Residue:
406
  
Inhibitor
Name:
BDBM50368278
Synonyms:
CHEMBL1790497
Type:
Small organic molecule
Emp. Form.:
C50H75N9O8
Mol. Mass.:
930.186
SMILES:
CC[C@H](C)[C@H](NC(=O)[C@@H](C[C@H](O)[C@H](CC(C)C)NC(=O)[C@H](Cc1cnc[nH]1)N(C)C(=O)[C@H](Cc1ccccc1)NC(=O)[C@@H]1CCCN1C(=O)OC(C)(C)C)C(C)C)C(=O)NCc1ccccn1
: