Target
Renin
Ligand
BDBM50022848
Substrate
Meas. Tech.
ChEBML_196287
IC50
5000±n/a nM
Citation
 Sawyer, TKPals, DTMao, BStaples, DJde Vaux, AEMaggiora, LLAffholter, JAKati, WDuchamp, DHester, JB Design, structure-activity, and molecular modeling studies of potent renin inhibitory peptides having N-terminal Nin-For-Trp (Ftr): angiotensinogen congeners modified by P1-P1' Phe-Phe, Sta, Leu psi[CH(OH)CH2]Val or leu psi[CH2NH]Val substitutions. J Med Chem 31:18-30 (1988)  
Target
Name:
Renin
Synonyms:
Angiotensinogenase RENI_HUMAN
Type:
Enzyme
Mol. Mass.:
45058.99
Organism:
Homo sapiens (Human)
Description:
Residue:
406
  
Inhibitor
Name:
BDBM50022848
Synonyms:
Ac-Trp-Pro-Phe-His-Phe-Phe-Val-Ftr-NH2 | CHEMBL262208
Type:
Small organic molecule
Emp. Form.:
C68H75N13O10
Mol. Mass.:
1234.4042
SMILES:
CC(C)[C@H](NC(=O)[C@H](Cc1ccccc1)NC(=O)[C@H](Cc1ccccc1)NC(=O)[C@H](Cc1cnc[nH]1)NC(=O)[C@H](Cc1ccccc1)NC(=O)[C@@H]1CCCN1C(=O)[C@@H](Cc1c[nH]c2ccccc12)NC(C)=O)C(=O)N[C@@H](Cc1cn(C=O)c2ccccc12)C(N)=O
: