Target
Renin
Ligand
BDBM50022847
Substrate
Meas. Tech.
ChEBML_196289
IC50
2400±n/a nM
Citation
 Sawyer, TKPals, DTMao, BStaples, DJde Vaux, AEMaggiora, LLAffholter, JAKati, WDuchamp, DHester, JB Design, structure-activity, and molecular modeling studies of potent renin inhibitory peptides having N-terminal Nin-For-Trp (Ftr): angiotensinogen congeners modified by P1-P1' Phe-Phe, Sta, Leu psi[CH(OH)CH2]Val or leu psi[CH2NH]Val substitutions. J Med Chem 31:18-30 (1988)  
Target
Name:
Renin
Synonyms:
RENI_RAT Ren1
Type:
PROTEIN
Mol. Mass.:
44272.67
Organism:
Rattus norvegicus
Description:
ChEMBL_222765
Residue:
402
  
Inhibitor
Name:
BDBM50022847
Synonyms:
Ac-Ftr-Pro-Phe-His-Sta-Ftr-NH2 | CHEMBL100924
Type:
Small organic molecule
Emp. Form.:
C42H53N9O8
Mol. Mass.:
811.9257
SMILES:
CC(C)CC(NC(=O)[C@H](Cc1cnc[nH]1)NC(=O)[C@H](Cc1ccccc1)NC(=O)[C@@H]1CCCN1C(=O)[C@H](Cc1cn(C=O)c2ccccc12)NC(C)=O)C(O)CC(N)=O
: