Target
Renin
Ligand
BDBM912
Substrate
Meas. Tech.
ChEBML_196289
IC50
13000±n/a nM
Citation
 Sawyer, TKPals, DTMao, BStaples, DJde Vaux, AEMaggiora, LLAffholter, JAKati, WDuchamp, DHester, JB Design, structure-activity, and molecular modeling studies of potent renin inhibitory peptides having N-terminal Nin-For-Trp (Ftr): angiotensinogen congeners modified by P1-P1' Phe-Phe, Sta, Leu psi[CH(OH)CH2]Val or leu psi[CH2NH]Val substitutions. J Med Chem 31:18-30 (1988)  
Target
Name:
Renin
Synonyms:
RENI_RAT Ren1
Type:
PROTEIN
Mol. Mass.:
44272.67
Organism:
Rattus norvegicus
Description:
ChEMBL_222765
Residue:
402
  
Inhibitor
Name:
BDBM912
Synonyms:
(3S,4S)-3-hydroxy-4-[(2S)-2-[(3S,4S)-3-hydroxy-6-methyl-4-[(2S)-3-methyl-2-[(2S)-3-methyl-2-(3-methylbutanamido)butanamido]butanamido]heptanamido]propanamido]-6-methylheptanoic acid Iva-Val-Val-Sta-Ala-Sta-OH PEPSTATIN US9115083, Pepstatin
Type:
Small organic molecule
Emp. Form.:
C34H63N5O9
Mol. Mass.:
685.8921
SMILES:
CC(C)C[C@H](NC(=O)[C@H](C)NC(=O)C[C@H](O)[C@H](CC(C)C)NC(=O)[C@@H](NC(=O)[C@@H](NC(=O)CC(C)C)C(C)C)C(C)C)[C@@H](O)CC(O)=O
: