Target
Alpha-1A adrenergic receptor
Ligand
BDBM50019060
Substrate
Meas. Tech.
ChEMBL_33232 (CHEMBL873047)
Ki
>50000±n/a nM
Citation
 Adejare, AGusovsky, FPadgett, WCreveling, CRDaly, JWKirk, KL Syntheses and adrenergic activities of ring-fluorinated epinephrines. J Med Chem 31:1972-7 (1988)  
Target
Name:
Alpha-1A adrenergic receptor
Synonyms:
ADA1A_HUMAN ADRA1C Alpha 1A-adrenoceptor Alpha adrenergic receptor 1a Alpha-adrenergic receptor 1c adrenergic Alpha1 | adrenergic Alpha1C
Type:
Cell-surface receptors
Mol. Mass.:
51511.67
Organism:
Homo sapiens (Human)
Description:
P35348
Residue:
466
  
Inhibitor
Name:
BDBM50019060
Synonyms:
(+/-)4-(2-Amino-1-hydroxy-ethyl)-3-fluoro-benzene-1,2-diol 4-(2-Amino-1-hydroxy-ethyl)-3-fluoro-benzene-1,2-diol(2-FNE) | CHEMBL287587
Type:
Small organic molecule
Emp. Form.:
C8H10FNO3
Mol. Mass.:
187.1683
SMILES:
NCC(O)c1ccc(O)c(O)c1F
: