Target
Aminopeptidase B
Ligand
BDBM50022742
Substrate
Meas. Tech.
ChEBML_35352
Ki
>1000000±n/a nM
Citation
 Ocain, TDRich, DH Synthesis of sulfur-containing analogues of bestatin. Inhibition of aminopeptidases by alpha-thiolbestatin analogues. J Med Chem 31:2193-9 (1988)  
Target
Name:
Aminopeptidase B
Synonyms:
AMPB_RAT Arginine aminopeptidase Cytosol aminopeptidase IV | Rnpep
Type:
PROTEIN
Mol. Mass.:
72609.93
Organism:
Rattus norvegicus
Description:
ChEMBL_1344423
Residue:
650
  
Inhibitor
Name:
BDBM50022742
Synonyms:
3-Amino-2-hydroxy-N-(3-methyl-butyl)-4-phenyl-thiobutyramide; Trifluoro acetate | CHEMBL67868
Type:
Small organic molecule
Emp. Form.:
C15H24N2OS
Mol. Mass.:
280.429
SMILES:
CC(C)CCNC(=S)[C@@H](O)[C@H](N)Cc1ccccc1
: