Target
5-hydroxytryptamine receptor 1A
Ligand
BDBM50020121
Substrate
Meas. Tech.
ChEBML_1423
Ki
37±n/a nM
Citation
 Abou-Gharbia, MPatel, URWebb, MBMoyer, JAAndree, THMuth, EA Polycyclic aryl- and heteroarylpiperazinyl imides as 5-HT1A receptor ligands and potential anxiolytic agents: synthesis and structure-activity relationship studies. J Med Chem 31:1382-92 (1988)  
Target
Name:
5-hydroxytryptamine receptor 1A
Synonyms:
5-HT-1A 5-HT1A 5-hydroxytryptamine receptor 1A (5HT1A) 5ht1a Htr1a Serotonin 1a (5-HT1a) receptor/Adrenergic receptor alpha-1 | Serotonin receptor 1A
Type:
G Protein-Coupled Receptor (GPCR)
Mol. Mass.:
46445.29
Organism:
Rattus norvegicus (rat)
Description:
Binding assays were performed using rat hippocampal membranes.
Residue:
422
  
Inhibitor
Name:
BDBM50020121
Synonyms:
4-[4-(3'-Chloro-2,3,5,6-tetrahydro-[1,2']bipyrazinyl-4-yl)-butyl]-4-aza-tricyclo[5.2.1.0*2,6*]dec-8-ene-3,5-dione;Hydrochloride | CHEMBL431295
Type:
Small organic molecule
Emp. Form.:
C21H26ClN5O2
Mol. Mass.:
415.916
SMILES:
Clc1nccnc1N1CCN(CCCCN2C(=O)C3C4CC(C=C4)C3C2=O)CC1
: