Target
D(2) dopamine receptor
Ligand
BDBM50023847
Substrate
Meas. Tech.
ChEBML_61437
IC50
>1000±n/a nM
Citation
 Monkovic, IWillner, DAdam, MABrown, MCrenshaw, RRFuller, CEJuby, PFLuke, GMMatiskella, JAMontzka, TA Substituted benzamides. 1. Potential nondopaminergic antagonists of chemotherapy-induced nausea and emesis. J Med Chem 31:1548-58 (1988)  
Target
Name:
D(2) dopamine receptor
Synonyms:
DOPAMINE D2 DOPAMINE D2 Short Dopamine D2 receptor Drd2
Type:
G Protein-Coupled Receptor (GPCR)
Mol. Mass.:
50931.60
Organism:
Rattus norvegicus (rat)
Description:
P61169
Residue:
444
  
Inhibitor
Name:
BDBM50023847
Synonyms:
4-Amino-5-chloro-N-(2-diethylamino-ethyl)-2-(1-ethyl-2-oxo-propoxy)-benzamide | CHEMBL39930
Type:
Small organic molecule
Emp. Form.:
C18H28ClN3O3
Mol. Mass.:
369.886
SMILES:
CCC(Oc1cc(N)c(Cl)cc1C(=O)NCCN(CC)CC)C(C)=O
: