Target
Adenosylhomocysteinase
Ligand
BDBM50023885
Substrate
Meas. Tech.
ChEBML_197366
IC50
200000±n/a nM
Citation
 Borcherding, DRNarayanan, SHasobe, MMcKee, JGKeller, BTBorchardt, RT Potential inhibitors of S-adenosylmethionine-dependent methyltransferases. 11. Molecular dissections of neplanocin A as potential inhibitors of S-adenosylhomocysteine hydrolase. J Med Chem 31:1729-38 (1988)  
Target
Name:
Adenosylhomocysteinase
Synonyms:
Adenosylhomocysteinase Ahcy Liver copper-binding protein SAHH_MOUSE
Type:
PROTEIN
Mol. Mass.:
47687.65
Organism:
Mus musculus
Description:
ChEMBL_196559
Residue:
432
  
Inhibitor
Name:
BDBM50023885
Synonyms:
4-(4-Amino-imidazo[4,5-c]pyridin-1-yl)-but-2-yn-1-ol | CHEMBL49511
Type:
Small organic molecule
Emp. Form.:
C10H10N4O
Mol. Mass.:
202.2126
SMILES:
Nc1nccc2n(CC#CCO)cnc12
: