Target
Adenosylhomocysteinase
Ligand
BDBM50367765
Substrate
Meas. Tech.
ChEBML_197203
Ki
>1000±n/a nM
Citation
 Borcherding, DRNarayanan, SHasobe, MMcKee, JGKeller, BTBorchardt, RT Potential inhibitors of S-adenosylmethionine-dependent methyltransferases. 11. Molecular dissections of neplanocin A as potential inhibitors of S-adenosylhomocysteine hydrolase. J Med Chem 31:1729-38 (1988)  
Target
Name:
Adenosylhomocysteinase
Synonyms:
AHCY SAHH | SAHH_HUMAN
Type:
PROTEIN
Mol. Mass.:
47714.06
Organism:
Homo sapiens (Human)
Description:
ChEMBL_1507791
Residue:
432
  
Inhibitor
Name:
BDBM50367765
Synonyms:
CHEMBL1794978
Type:
Small organic molecule
Emp. Form.:
C11H15N5O3
Mol. Mass.:
265.2685
SMILES:
Nc1ncnc2n(C\C=C(/CO)[C@@H](O)CO)cnc12
: