Target
Adenosylhomocysteinase
Ligand
BDBM50023889
Substrate
Meas. Tech.
ChEBML_197366
IC50
61000±n/a nM
Citation
 Borcherding, DRNarayanan, SHasobe, MMcKee, JGKeller, BTBorchardt, RT Potential inhibitors of S-adenosylmethionine-dependent methyltransferases. 11. Molecular dissections of neplanocin A as potential inhibitors of S-adenosylhomocysteine hydrolase. J Med Chem 31:1729-38 (1988)  
Target
Name:
Adenosylhomocysteinase
Synonyms:
Adenosylhomocysteinase Ahcy Liver copper-binding protein SAHH_MOUSE
Type:
PROTEIN
Mol. Mass.:
47687.65
Organism:
Mus musculus
Description:
ChEMBL_196559
Residue:
432
  
Inhibitor
Name:
BDBM50023889
Synonyms:
5-(4-Amino-imidazo[4,5-c]pyridin-1-yl)-pent-3-ene-1,2-diol | CHEMBL296880
Type:
Small organic molecule
Emp. Form.:
C11H14N4O2
Mol. Mass.:
234.2545
SMILES:
Nc1nccc2n(C\C=C/[C@@H](O)CO)cnc12
: