Target
Adenosylhomocysteinase
Ligand
BDBM50011148
Substrate
Meas. Tech.
ChEBML_197366
IC50
145000±n/a nM
Citation
 Borcherding, DRNarayanan, SHasobe, MMcKee, JGKeller, BTBorchardt, RT Potential inhibitors of S-adenosylmethionine-dependent methyltransferases. 11. Molecular dissections of neplanocin A as potential inhibitors of S-adenosylhomocysteine hydrolase. J Med Chem 31:1729-38 (1988)  
Target
Name:
Adenosylhomocysteinase
Synonyms:
Adenosylhomocysteinase Ahcy Liver copper-binding protein SAHH_MOUSE
Type:
PROTEIN
Mol. Mass.:
47687.65
Organism:
Mus musculus
Description:
ChEMBL_196559
Residue:
432
  
Inhibitor
Name:
BDBM50011148
Synonyms:
(Z)-4-(6-Amino-purin-9-yl)-but-2-en-1-ol CHEMBL45537
Type:
Small organic molecule
Emp. Form.:
C9H11N5O
Mol. Mass.:
205.2165
SMILES:
Nc1ncnc2n(C\C=C/CO)cnc12
: