Target
Aldo-keto reductase family 1 member B1
Ligand
BDBM50016557
Substrate
Meas. Tech.
ChEBML_32099
IC50
400±n/a nM
Citation
 DeRuiter, JBorne, RFMayfield, CA N- and 2-substituted N-(phenylsulfonyl)glycines as inhibitors of rat lens aldose reductase. J Med Chem 32:145-51 (1989)  
Target
Name:
Aldo-keto reductase family 1 member B1
Synonyms:
ALDR_RAT Akr1b4 Aldr1
Type:
PROTEIN
Mol. Mass.:
35797.87
Organism:
Rattus norvegicus
Description:
ChEMBL_1512484
Residue:
316
  
Inhibitor
Name:
BDBM50016557
Synonyms:
(Naphthalene-2-sulfonylamino)-acetic acid | CHEMBL288077
Type:
Small organic molecule
Emp. Form.:
C12H11NO4S
Mol. Mass.:
265.285
SMILES:
OC(=O)CNS(=O)(=O)c1ccc2ccccc2c1
: