Target
Aromatase
Ligand
BDBM91718
Substrate
Meas. Tech.
ChEMBL_51030 (CHEMBL662243)
Ki
260±n/a nM
Citation
 Sherwin, PFMcMullan, PCCovey, DF Effects of steroid D-ring modification on suicide inactivation and competitive inhibition of aromatase by analogues of androsta-1,4-diene-3,17-dione. J Med Chem 32:651-8 (1989)  
Target
Name:
Aromatase
Synonyms:
ARO1 CP19A_HUMAN CYP19 CYPXIX Cytochrome P450 19A1 Cytochrome P450-C19 (CYP19) FL cytokine receptor precursor | P-450AROM
Type:
Enzyme
Mol. Mass.:
57888.92
Organism:
Homo sapiens (Human)
Description:
P11511
Residue:
503
  
Inhibitor
Name:
BDBM91718
Synonyms:
Androst-1,4-dien-3,17-dione, 7
Type:
Small organic molecule
Emp. Form.:
C19H24O2
Mol. Mass.:
284.3927
SMILES:
C[C@]12CC[C@H]3[C@@H](CCC4=CC(=O)C=C[C@]34C)[C@@H]1CCC2=O
: