Target
Aromatase
Ligand
BDBM50020640
Substrate
Meas. Tech.
ChEBML_51028
Ki
1100±n/a nM
Citation
 Sherwin, PFMcMullan, PCCovey, DF Effects of steroid D-ring modification on suicide inactivation and competitive inhibition of aromatase by analogues of androsta-1,4-diene-3,17-dione. J Med Chem 32:651-8 (1989)  
Target
Name:
Aromatase
Synonyms:
ARO1 CP19A_HUMAN CYP19 CYPXIX Cytochrome P450 19A1 Cytochrome P450-C19 (CYP19) FL cytokine receptor precursor | P-450AROM
Type:
Enzyme
Mol. Mass.:
57888.92
Organism:
Homo sapiens (Human)
Description:
P11511
Residue:
503
  
Inhibitor
Name:
BDBM50020640
Synonyms:
10,13-Dimethyl-6,7,8,9,10,11,12,13,14,15,16,17-dodecahydro-cyclopenta[a]phenanthren-3-one | CHEMBL349300
Type:
Small organic molecule
Emp. Form.:
C19H26O
Mol. Mass.:
270.4091
SMILES:
CC12CCCC1C1CCC3=CC(=O)C=CC3(C)C1CC2
: