Target
Aromatase
Ligand
BDBM50020647
Substrate
Meas. Tech.
ChEMBL_51028 (CHEMBL664585)
Ki
8560±n/a nM
Citation
 Sherwin, PFMcMullan, PCCovey, DF Effects of steroid D-ring modification on suicide inactivation and competitive inhibition of aromatase by analogues of androsta-1,4-diene-3,17-dione. J Med Chem 32:651-8 (1989)  
Target
Name:
Aromatase
Synonyms:
ARO1 CP19A_HUMAN CYP19 CYPXIX Cytochrome P450 19A1 Cytochrome P450-C19 (CYP19) FL cytokine receptor precursor | P-450AROM
Type:
Enzyme
Mol. Mass.:
57888.92
Organism:
Homo sapiens (Human)
Description:
P11511
Residue:
503
  
Inhibitor
Name:
BDBM50020647
Synonyms:
7-Hydroxymethyl-4a,7-dimethyl-4b,5,6,7,8,8a,9,10-octahydro-4aH-phenanthren-2-one | CHEMBL348154
Type:
Small organic molecule
Emp. Form.:
C17H24O2
Mol. Mass.:
260.3713
SMILES:
CC1(CO)CCC2C(CCC3=CC(=O)C=CC23C)C1
: