Target
Cholinesterase
Ligand
BDBM50018228
Substrate
Meas. Tech.
ChEBML_41436
Ki
4600±n/a nM
Citation
 Leader, HSmejkal, RMPayne, CSPadilla, FNDoctor, BPGordon, RKChiang, PK Binary antidotes for organophosphate poisoning: aprophen analogues that are both antimuscarinics and carbamates. J Med Chem 32:1522-8 (1989)  
Target
Name:
Cholinesterase
Synonyms:
Acylcholine acylhydrolase Butyrylcholine esterase (BChE) Butyrylcholinesterase (BuChE) CHLE_HUMAN Cholinesterases Pseudocholinesterase
Type:
Homotetramer
Mol. Mass.:
68422.27
Organism:
Homo sapiens (Human)
Description:
P06276
Residue:
602
  
Inhibitor
Name:
BDBM50018228
Synonyms:
2,2-Bis-(4-dimethylcarbamoyloxy-phenyl)-propionic acid 2-diethylamino-ethyl ester | CHEMBL290912
Type:
Small organic molecule
Emp. Form.:
C27H37N3O6
Mol. Mass.:
499.5992
SMILES:
CCN(CC)CCOC(=O)C(C)(c1ccc(OC(=O)N(C)C)cc1)c1ccc(OC(=O)N(C)C)cc1
: