Target
Muscarinic receptor M1
Ligand
BDBM50018229
Substrate
Meas. Tech.
ChEBML_138126
Ki
100±n/a nM
Citation
 Leader, HSmejkal, RMPayne, CSPadilla, FNDoctor, BPGordon, RKChiang, PK Binary antidotes for organophosphate poisoning: aprophen analogues that are both antimuscarinics and carbamates. J Med Chem 32:1522-8 (1989)  
Target
Name:
Muscarinic receptor M1
Synonyms:
Muscarinic acetylcholine receptor M1
Type:
PROTEIN
Mol. Mass.:
15022.43
Organism:
Bos taurus
Description:
ChEMBL_140161
Residue:
139
  
Inhibitor
Name:
BDBM50018229
Synonyms:
2-(4-Hydroxy-phenyl)-2-phenyl-propionic acid 2-diethylamino-ethyl ester | CHEMBL37372
Type:
Small organic molecule
Emp. Form.:
C21H27NO3
Mol. Mass.:
341.444
SMILES:
CCN(CC)CCOC(=O)C(C)(c1ccccc1)c1ccc(O)cc1
: