Target
Cholinesterase
Ligand
BDBM50018230
Substrate
Meas. Tech.
ChEMBL_41436 (CHEMBL654415)
Ki
1400±n/a nM
Citation
 Leader, HSmejkal, RMPayne, CSPadilla, FNDoctor, BPGordon, RKChiang, PK Binary antidotes for organophosphate poisoning: aprophen analogues that are both antimuscarinics and carbamates. J Med Chem 32:1522-8 (1989)  
Target
Name:
Cholinesterase
Synonyms:
Acylcholine acylhydrolase Butyrylcholine esterase (BChE) Butyrylcholinesterase (BuChE) CHLE_HUMAN Cholinesterases Pseudocholinesterase
Type:
Homotetramer
Mol. Mass.:
68422.27
Organism:
Homo sapiens (Human)
Description:
P06276
Residue:
602
  
Inhibitor
Name:
BDBM50018230
Synonyms:
2-(4-Methylcarbamoyloxy-phenyl)-2-phenyl-propionic acid 2-diethylamino-ethyl ester | CHEMBL36583
Type:
Small organic molecule
Emp. Form.:
C23H30N2O4
Mol. Mass.:
398.4953
SMILES:
CCN(CC)CCOC(=O)C(C)(c1ccccc1)c1ccc(OC(=O)NC)cc1
: